RDF description of 漁船利用状況
primary topic: 漁船利用状況

漁船利用状況
type: TerminologyConcept
description: 11月１日現在保有する動力船を使用して過去１年間に操業した漁業種類が単一であったか複数であったか。
created: 2017-12-01
broader: Ta00615
in scheme: TerminologyConceptScheme
top concept of: TerminologyConceptScheme