漁船隻数
type: TerminologyConcept
description: 過去１年間に使用した無動力船及び船外機付船のうち11月１日現在で保有している隻数。無動力船とは、推進機関を付けない漁船のことをいう。船外機付船とは、無動力船に取り外しのできる推進機関を付けた漁船をいう。
created: 2017-12-01
broader: Ta00442
top concept of: TerminologyConceptScheme
in scheme: TerminologyConceptScheme

RDF description of 漁船隻数
primary topic: 漁船隻数