RDF description of 漁船の種類
primary topic: 漁船の種類

漁船の種類
type: TerminologyConcept
in scheme: TerminologyConceptScheme
top concept of: TerminologyConceptScheme
broader: Ta00655
created: 2017-12-01
description: 過去１年間に使用した漁船が動力船、船外機付船、無動力船のいずれであったか。漁船とは、漁業経営体が所有又は借りている船のうち、過去１年間に自己の漁業生産に使用した主船及び付属船（灯船、魚群探索船、網船、運搬船等）をいう。なお、漁船登録を受けていても、過去１年間漁業生産に使用しなかった船及び直接漁業生産に使用しなかった船（遊漁のみに使用した船、買い付け用運搬船等）は含まない。動力船とは、推進機関を船体に固定した漁船のことをいう。なお、船内に機関を装備し、甲板端にプロペラを設置する船内外機付船については動力船に含む。船外機付船とは、無動力船に取り外しのできる推進機関を付けた漁船をいう。無動力船とは、推進機関を付けない漁船のことをいう。