漁業雇われ・共同経営とそれ以外で従事日数の多いもの
type: TerminologyConcept
description: 「漁業雇われ」又は「共同経営に出資従事」に従事した日数と、「漁業雇われ又は共同経営に出資従事以外の仕事」に従事した日数どちらが多いか。
created: 2017-12-01
broader: Ta00531
top concept of: TerminologyConceptScheme
in scheme: TerminologyConceptScheme

RDF description of 漁業雇われ・共同経営とそれ以外で従事日数の多いもの
primary topic: 漁業雇われ・共同経営とそれ以外で従事日数の多いもの