漁業管理費
type: TerminologyConcept
description: 過去５年間の通常の時期に行った漁業管理の内容すべてについて、これらの管理に要した費用の総額。
created: 2017-12-01
broader: Ta00071
in scheme: TerminologyConceptScheme
top concept of: TerminologyConceptScheme

RDF description of 漁業管理費
primary topic: 漁業管理費