居所不明の学齢児童生徒数
type: TerminologyConcept
description: 保護者が就学させなければならない学齢児童生徒で、調査実施年度の５月１日時点において１年以上居所不明のため、学齢簿の編製上、就学義務の免除又は猶予を受けている者と同様に、別に薄冊を編製されている者の数。
created: 2017-12-01
broader: Ta00134
top concept of: TerminologyConceptScheme
in scheme: TerminologyConceptScheme

RDF description of 居所不明の学齢児童生徒数
primary topic: 居所不明の学齢児童生徒数