居住室数_3
type: TerminologyConcept
description: 住宅内の居間、茶の間、寝室、客間、書斎、応接間、仏間、食事室等の居住用の室の数。玄関、台所（炊事場）、トイレ、浴室、廊下、土間等、及び店、事務室、旅館の客室等の営業用の室は除く。但し、ふだん居住用に使用している室は、営業用に使っていても居住室に含める。ダイニング・キッチン（食事室兼台所）は、流しや調理台などを除いた広さが３畳以上の場合には含む。住宅内に２世帯以上が住んでいる場合、住宅内の主な世帯（家の持ち主や借り主の世帯など）が記入するときは同居している世帯の使用している室も除いた数とし、同居している世帯が記入するときはその世帯の使用している室のみの数とする。
created: 2017-12-01
broader: Ta00453
top concept of: TerminologyConceptScheme
in scheme: TerminologyConceptScheme

RDF description of 居住室数_3
primary topic: 居住室数_3