牛馬の種類
type: TerminologyConcept
description: 牛馬の種類。肉用牛、繁殖牛、馬の３区分とする。肉用牛とは、収益源体として肥育・育成中の牛をいい、繁殖牛とは、肉用牛以外の用役源体としての搾乳牛、繁殖用めす成牛、繁殖用種おす成牛、将来搾乳用又は繁殖用として育成中の子牛をいう。
created: 2017-12-01
broader: Ta00596
top concept of: TerminologyConceptScheme
in scheme: TerminologyConceptScheme

RDF description of 牛馬の種類
primary topic: 牛馬の種類