RDF description of 給与所得者数
primary topic: 給与所得者数

給与所得者数
type: TerminologyConcept
description: 事業所から給与の支払を受けている者の数。事業所に日々雇用されている者で、「給与所得の源泉徴収税額表（日額表）」の丙欄が適用されている者は除く。
created: 2017-12-01
broader: Ta00116
in scheme: TerminologyConceptScheme
top concept of: TerminologyConceptScheme