給与支給月数
type: TerminologyConcept
description: 事業所で本人に対し１年間に給与を支給した月数。但し、本人が年の中途で採用されたており、前職で支給された給与を含めて年末調整を行った場合には、前職での給与支給月数を通算する。
created: 2017-12-01
broader: Ta00359
top concept of: TerminologyConceptScheme
in scheme: TerminologyConceptScheme

RDF description of 給与支給月数
primary topic: 給与支給月数