給湯器所有数
type: TerminologyConcept
narrower: si327010021
top concept of: TerminologyConceptScheme
narrower: si327020019
narrower: si327020021
narrower: si327010022
narrower: si327020022
created: 2017-12-01
narrower: si327010020
in scheme: TerminologyConceptScheme
description: 給湯器の所有総数。大量給湯能力を持ち、常時タンク内に一定量の熱湯が貯められるもので、一定の温度になると点火及び消火するもの。熱源（太陽、電気、ガスなど）は問わない。ガス瞬間湯沸器は除く。
broader: Ta00430
narrower: si327010019
narrower: si327020020

RDF description of 給湯器所有数
primary topic: 給湯器所有数