RDF description of 求職活動の有無
primary topic: 求職活動の有無

求職活動の有無
type: TerminologyConcept
description: 調査期間その他指定する期間中に仕事を探したり開業の準備をしたりしたかどうかの別。ここでいう「仕事を探した」とは、公共職業安定所（ハローワーク）や民間職業紹介所などに申し込んだり、労働者派遣事業所に登録したり、新聞や求人情報誌の求人広告に応募したり、仕事の紹介を人に依頼したり、事業所の求人に応募したりしたことであり、以前に行ったこれらの活動の結果を待っていた場合を含む。また、「開業の準備をした」とは、事業を始めるための資金、資材、設備の調達などの準備をしていたことであり、将来資格を取り開業するために学校に行くなどして勉強していた場合は含まない。
created: 2017-12-01
broader: Ta00534
in scheme: TerminologyConceptScheme
narrower: si188020018
narrower: si188010017
narrower: si188010010
narrower: si188020011
top concept of: TerminologyConceptScheme