救急告示の有無
type: TerminologyConcept
description: 「救急病院等を定める省令」（昭和39年厚生省令第８号）第２条第１項の規定に基づき、救急病院としての都道府県知事による告示の有無。
created: 2017-12-01
broader: Ta00638
top concept of: TerminologyConceptScheme
in scheme: TerminologyConceptScheme

RDF description of 救急告示の有無
primary topic: 救急告示の有無