救急の状況
type: TerminologyConcept
description: 当該医療施設における患者の来院時の救急の状況をいい、救急車により搬送され受診したもの、救急外来窓口を経由して受診したもの、当該医療施設が表示する診療時間以外に受診したものいう。
created: 2017-12-01
broader: Ta00632
top concept of: TerminologyConceptScheme
in scheme: TerminologyConceptScheme

RDF description of 救急の状況
primary topic: 救急の状況