休職等教員数
type: TerminologyConcept
description: 教員組合事務専従、職務上の負傷疾病、結核、その他の理由により、原則として休職発令に基づき休職している教員の数。
created: 2017-12-01
broader: Ta00122
in scheme: TerminologyConceptScheme
top concept of: TerminologyConceptScheme

RDF description of 休職等教員数
primary topic: 休職等教員数