休止・休診状況
type: TerminologyConcept
description: 医療法上の休止届を既に出してある休止の状態であるか、10月１日現在で診療を行っていない休診の状態であるかの状況。
created: 2017-12-01
broader: Ta00637
top concept of: TerminologyConceptScheme
in scheme: TerminologyConceptScheme

RDF description of 休止・休診状況
primary topic: 休止・休診状況