休学者数
type: TerminologyConcept
description: 高等教育機関（大学・短期大学・高等専門学校）の在学者のうち休学届けを提出している者の数。
created: 2017-12-01
broader: Ta00134
top concept of: TerminologyConceptScheme
in scheme: TerminologyConceptScheme

RDF description of 休学者数
primary topic: 休学者数