RDF description of 技術取引支払額
primary topic: 技術取引支払額

技術取引支払額
type: TerminologyConcept
in scheme: TerminologyConceptScheme
top concept of: TerminologyConceptScheme
broader: Ta00097
created: 2017-12-01
description: 新規・継続を問わず決算年度１年間に、企業との間にノウハウ（特許権、実用新案権、意匠権の導入、供与に付随したものは含めない。）、技術指導、商標登録における技術の受入を行った場合の対価の支払金額。