帰国子女数A
type: TerminologyConcept
description: 学校に在籍している児童生徒のうち、海外勤務者等の子女で、引続き１年を超える期間海外に在留し、前年度間に帰国した児童生徒の数。海外勤務者等とは、１．日本国籍を有する者で、海外に所在する機関、事業所等に勤務するか又は海外において研究・研修を行うことなどを目的として日本を出国し、海外に滞在していた者又は現在なお在留している者、２．終戦前（昭和20年9月2日以前をいう。）から引続き外地に居住していた者で、日本に帰国した者である。【平成25年5月 「帰国児童数」に定義内容を変更】
created: 2017-12-01
broader: Ta00134
top concept of: TerminologyConceptScheme
in scheme: TerminologyConceptScheme

RDF description of 帰国子女数A
primary topic: 帰国子女数A