RDF description of 機械・装置の賃借料額
primary topic: 機械・装置の賃借料額

機械・装置の賃借料額
type: TerminologyConcept
in scheme: TerminologyConceptScheme
top concept of: TerminologyConceptScheme
broader: Ta00082
created: 2017-12-01
description: 賃貸借契約に基づいて、機械・装置を賃借する場合に対価として支払う経費の額。賃貸借契約とは、当事者の一方が相手方に物の使用収益をさせ、これに対して相手方が賃料を支払う契約を指す。リース契約による支払いリース料を含む。機械・装置とは、産業用機械、工作機械、土木・建設機械、医療用機器、輸送用機器（自動車、フォークリフト等）、商業用及びサービス業務用機械・設備、情報関連機器（電算機、パソコン、CAD、CAM、サーバ等）、事務用機械（複写機等）等を指す。