機械・装置の資産額_1
type: TerminologyConcept
description: 取得価額が10万円以上で耐用年数が１年以上の車両・機械の購入費用。取得に要した運賃、裾付けに要した費用を含む。中古品の購入に要した費用は含めない。物品賃貸業においては、賃貸するために購入した商品の額。消費税を含める。
created: 2017-12-01
broader: Ta00030
top concept of: TerminologyConceptScheme
in scheme: TerminologyConceptScheme

RDF description of 機械・装置の資産額_1
primary topic: 機械・装置の資産額_1