RDF description of 期中棚卸増減額
primary topic: 期中棚卸増減額

期中棚卸増減額
type: TerminologyConcept
in scheme: TerminologyConceptScheme
top concept of: TerminologyConceptScheme
broader: Ta00085
created: 2017-12-01
description: 当期における生産物（農作物）、仕掛品（立毛作物、中小家畜物等）、原材料の棚卸高の増減額。