企業年金・個人年金等掛金支払額
type: TerminologyConcept
description: 企業年金や個人年金に支払った掛金の額。企業年金とは、企業が従業員に公的年金とは別に独自に支給する年金。自社年金、中小企業退職金共済制度・特定退職金共済制度による年金、税制適格退職年金、確定拠出年金（企業型）、確定給付企業年金（規約型・基金型）を指す。個人年金とは、世帯員個人が保険会社等と契約を結ぶ年金。簡易生命保険や全共済、生命保険会社などが扱う保険型個人年金と、銀行や証券会社などが扱う貯蓄型個人年金の２種類から成る。その他、国民年金基金、農業者年金、確定拠出年金（個人型）を含む。
created: 2017-12-01
broader: Ta00024
top concept of: TerminologyConceptScheme
in scheme: TerminologyConceptScheme

RDF description of 企業年金・個人年金等掛金支払額
primary topic: 企業年金・個人年金等掛金支払額