RDF description of 関連会社数Ａ
primary topic: 関連会社数Ａ

関連会社数Ａ
type: TerminologyConcept
in scheme: TerminologyConceptScheme
top concept of: TerminologyConceptScheme
broader: Ta00379
created: 2017-12-01
description: ２０％以上～５０％以下の議決権を所有している国内の企業をいう。【平成22年３月 定義内容の変更】