間貸分の畳数
type: TerminologyConcept
description: 居住室のうち間貸ししている部分の合計畳数。洋間など畳を敷いていない場合は、3.3平方メートル（１坪）を２畳の割合で換算して含める。居住室とは、居間、客間、茶の間、寝室、書斎、応接間、仏間、食事室など居住用の室をいう。離れなどの居住室も含める。玄関、台所（炊事場）、トイレ、浴室、物置、廊下、縁側、土間などや、店、事務室、旅館の客室など営業用の室は含まない。ただし、ふだん居住用に使っている室は、営業用に使っていても居住用に含める。昼間は業務のために使用し、夜間は就寝に使用している部屋は含める。ダイニングキッチン（食事室兼台所）も含める。
in scheme: TerminologyConceptScheme
narrower: si246020025
broader: Ta00221
created: 2017-12-01
top concept of: TerminologyConceptScheme
narrower: si246010025

RDF description of 間貸分の畳数
primary topic: 間貸分の畳数