RDF description of 肝臓・胆嚢・膵臓悪性腫瘍手術実施件数
primary topic: 肝臓・胆嚢・膵臓悪性腫瘍手術実施件数

肝臓・胆嚢・膵臓悪性腫瘍手術実施件数
type: TerminologyConcept
in scheme: TerminologyConceptScheme
top concept of: TerminologyConceptScheme
broader: Ta00402
created: 2017-12-01
description: 開腹による当該悪性腫瘍に対する手術の実施件数。姑息的手術も含む。ただし、生検のみを目的としたものは除く。