幹縄長
type: TerminologyConcept
description: はえ縄式のかき類養殖の幹縄の長さ。はえ縄式とは、たる、ドラム缶、合成樹脂等の浮子を付けたロープを海面に張り、このロープに種がきの垂下連をつるして養殖する方法をいう。幹縄とは海面に水平に張って垂下連を支える縄（ロープ）をいう。
created: 2017-12-01
broader: Ta00161
top concept of: TerminologyConceptScheme
in scheme: TerminologyConceptScheme

RDF description of 幹縄長
primary topic: 幹縄長