RDF description of 活魚槽の有無
primary topic: 活魚槽の有無

活魚槽の有無
type: TerminologyConcept
in scheme: TerminologyConceptScheme
top concept of: TerminologyConceptScheme
broader: Ta00543
created: 2017-12-01
description: 活魚槽の有無。活魚槽とは、漁獲物を活魚の状態で卸売りするために、陸上に常設しエアレーション等により酸素を供給するもの。