RDF description of 割増手当額・夜間割増手当額
primary topic: 割増手当額・夜間割増手当額

割増手当額・夜間割増手当額
type: TerminologyConcept
description: 労働協約、就業規則等において定められた所定労働時間を越えた労働時間又は補償休日における労働時間に対して支払われた手当の金額。
created: 2017-12-01
broader: Ta00087
in scheme: TerminologyConceptScheme
top concept of: TerminologyConceptScheme