RDF description of 学問別区分
primary topic: 学問別区分

学問別区分
type: TerminologyConcept
in scheme: TerminologyConceptScheme
top concept of: TerminologyConceptScheme
broader: Ta00515
created: 2017-12-01
description: 組織における主な研究の内容の区分。「文学」，「法学」，「経済学」，「社会学」，「その他の人文・社会科学」，「理学」，「工学」，「農学」，「保健」，「家政学」，「教育学」及び「その他」の別がある。（「法学」及び「家政学」は大学等のみ，「社会学」は非営利団体・公的機関のみ。）