RDF description of 学習・研究活動の有無
primary topic: 学習・研究活動の有無

学習・研究活動の有無
type: TerminologyConcept
description: 過去１年間に学習・研究活動を行ったかどうかの別。個人の自由時間の中で行う学習や研究で，社会人が仕事として行うものや，学生が学業として行うものは除く。
created: 2017-12-01
broader: Ta00658
in scheme: TerminologyConceptScheme
top concept of: TerminologyConceptScheme