学校薬剤師数
type: TerminologyConcept
description: 学校保健法により学校に配置される「学校歯科医」として、発令（委嘱）されている者の数。
created: 2017-12-01
broader: Ta00117
top concept of: TerminologyConceptScheme
in scheme: TerminologyConceptScheme

RDF description of 学校薬剤師数
primary topic: 学校薬剤師数