学校図書館事務従事者数
type: TerminologyConcept
description: 市町村立学校職員給与負担法が適用される学校の事務職員のうち、学校図書館専任の職員の数。
created: 2017-12-01
broader: Ta00117
top concept of: TerminologyConceptScheme
in scheme: TerminologyConceptScheme

RDF description of 学校図書館事務従事者数
primary topic: 学校図書館事務従事者数