RDF description of 学校給食調理従事員数
primary topic: 学校給食調理従事員数

学校給食調理従事員数
type: TerminologyConcept
description: 学校教育法に基づき学校に配置されている職員のうち、「学校栄養職員」以外の学校給食の調理に従事する者の数。
created: 2017-12-01
broader: Ta00117
in scheme: TerminologyConceptScheme
top concept of: TerminologyConceptScheme