学校栄養職員数
type: TerminologyConcept
description: 学校給食法に基づき学校に配置されている「学校栄養職員」の数。学校栄養職員は、学校給食の栄養に関する専門的事項をつかさどる職員のうち、栄養教諭以外の者である。
created: 2017-12-01
broader: Ta00117
top concept of: TerminologyConceptScheme
in scheme: TerminologyConceptScheme

RDF description of 学校栄養職員数
primary topic: 学校栄養職員数