RDF description of 学科
primary topic: 学科

学科
type: TerminologyConcept
in scheme: TerminologyConceptScheme
top concept of: TerminologyConceptScheme
broader: Ta00515
created: 2017-12-01
description: 大学、短期大学、高等専門学校、高等学校、中等教育学校の後期課程、特別支援学校の高等部、専修学校及び各種学校において、専攻分野ごとに置かれる組織。大学の場合は、学部の下に設けられる。