外注費_1
type: TerminologyConcept
description: 事業所外（海外を含む。）に業務の一部又は全部を委託、下請、その他の形式で発注した場合の経費の額。本社・支社・営業所間の同一企業内取引関係を含む。対象となる業務には製造だけでなく、サービスも含まれる。他の事業所に原材料を支給しないで製造を依頼した注文製造品の買取代金は含まない。
created: 2017-12-01
broader: Ta00079
top concept of: TerminologyConceptScheme
in scheme: TerminologyConceptScheme

RDF description of 外注費_1
primary topic: 外注費_1