外注加工費
type: TerminologyConcept
description: 原材料又は事業所が製造した製品を事業所外（海外を含む。）に支給して製造加工を委託して、支払った加工賃の額。本社・支社・営業所間の同一企業内取引関係を含む。支給した原材料費は含まない。また、他の事業所に原材料を支給しないで製造を依頼した注文製造品の買取代金は含まない。
created: 2017-12-01
broader: Ta00079
in scheme: TerminologyConceptScheme
top concept of: TerminologyConceptScheme

RDF description of 外注加工費
primary topic: 外注加工費