外因の状況符号
type: TerminologyConcept
description: 死亡の原因欄及び外因死の追加事項欄に記載された内容を基に、ICDのコーディングルールに従って厚生労働省において、コード化したもの。
created: 2017-12-01
broader: Ta00627
top concept of: TerminologyConceptScheme
in scheme: TerminologyConceptScheme

RDF description of 外因の状況符号
primary topic: 外因の状況符号