RDF description of 開店時刻
primary topic: 開店時刻

開店時刻
type: TerminologyConcept
description: 調査日現在の開店時刻。調査日が休業及び特別セール等により開店時刻が通常と異なる場合は、調査日に近い時点の通常の時刻とする。開店時刻とは、事業所の出入口が開いて来客が自由に入店できる時刻（営業時間の開始時刻）をいう。開店時刻がその事業所の部門によって異なる場合は、その事業所の主たる部門の時刻とする。製造小売業の場合は、商品の製造に要する時間は営業時間には含まない。通信販売、ネット販売については、営業時間は従業者の勤務時間とする。店頭販売をしている場合は、訪問販売員等及び配達員の営業時間は含まない。店頭販売をしていない場合は、訪問販売員等及び配達員の出店時刻とする。自動販売機の稼働時間は、営業時間とはしない。
created: 2017-12-01
broader: Ta00346
in scheme: TerminologyConceptScheme
top concept of: TerminologyConceptScheme