RDF description of 開設時期_4
primary topic: 開設時期_4

開設時期_4
type: TerminologyConcept
in scheme: TerminologyConceptScheme
top concept of: TerminologyConceptScheme
broader: Ta00342
created: 2017-12-01
description: 公立の場合は条例により設置された年。公立以外の場合は、事業所が現在の場所で事業を始めた時期。支所などの場合、本所などの開設時期ではなく、支所などが現在の場所で事業を始めた時期をいう。開設した時期をいつとするかは、次の区分による。現在の場所で新設されたとき、他の場所から移転して現在の所在地で営業したとき（一般的に見て、従前の場所と見られる程度の移転は、移転とはしない。）