会社の吸収合併の有無
type: TerminologyConcept
description: 吸収合併した（一つの会社が存続し、他の会社が解散して存続会社に吸収した）か否か。
created: 2017-12-01
broader: Ta00575
top concept of: TerminologyConceptScheme
in scheme: TerminologyConceptScheme

RDF description of 会社の吸収合併の有無
primary topic: 会社の吸収合併の有無