RDF description of 移乗の介助の要否
primary topic: 移乗の介助の要否

移乗の介助の要否
type: TerminologyConcept
description: 移乗（「ベットから車椅子へ」「車椅子からイスへ」「ベットからポータブルトイレへ」「車椅子からポータブルトイレへ」「畳からポータブルトイレへ」等、乗り移ること）にあたって実際に見守りや介助が必要かどうかを判定するものであり、その判定の区分は、「自立」（移乗が自分でできる場合。）、「見守りが必要」（直接介助する必要はないが、事故等がないように 常時、または時々見守る場合、移乗の際そばにいて確認する場合等。）、「一部介助が必要」（自分では移乗出来ないが、介護者が手を添える、体幹を支えるなどの介助があれば移乗できる場合。）、「全介助が必要」（自分では移乗が全くできないために、介助者が抱える、運ぶ等の介助によって移乗ができる場合）としている。
created: 2017-12-01
broader: Ta00628
in scheme: TerminologyConceptScheme
top concept of: TerminologyConceptScheme