貨物数
type: TerminologyConcept
description: 船舶及びはしけによって調査港湾と他の港湾等との間で輸送された貨物の数量。貨物の数量のうちトンは、原則として「フレート・トン」。貨物の数量のうち台は、自動車航送船で運送するバス、トラック、乗用車等の台数。
created: 2017-12-01
broader: Ta00464
top concept of: TerminologyConceptScheme
in scheme: TerminologyConceptScheme

RDF description of 貨物数
primary topic: 貨物数