貨物の搬入区分
type: TerminologyConcept
description: 「搬入」における貨物の区分（輸出・移出）。輸出・・・調査港湾と外国の港湾との間で直接取引のあった貨物で調査港湾において船積されたもの。移出・・・外国貿易貨物以外の貿易貨物で調査港湾において船積されたもの。
created: 2017-12-01
broader: Ta00619
top concept of: TerminologyConceptScheme
in scheme: TerminologyConceptScheme

RDF description of 貨物の搬入区分
primary topic: 貨物の搬入区分