RDF description of 貨物の輸移出入区分
primary topic: 貨物の輸移出入区分

貨物の輸移出入区分
type: TerminologyConcept
in scheme: TerminologyConceptScheme
top concept of: TerminologyConceptScheme
broader: Ta00619
created: 2017-12-01
description: 内国貿易（移出・移入）貨物・・・外国貿易貨物以外の貿易貨物。外国貿易（輸出・輸入）貨物・・・調査港湾と外国の港湾との間で直接取引のあった出入貨物。