RDF description of 貨物の搬出区分
primary topic: 貨物の搬出区分

貨物の搬出区分
type: TerminologyConcept
in scheme: TerminologyConceptScheme
top concept of: TerminologyConceptScheme
broader: Ta00619
created: 2017-12-01
description: 「搬出」における貨物の区分（輸入・移入）。輸入・・・調査港湾と外国の港湾との間で直接取引のあった貨物で調査港湾において船卸されたもの。移入・・・外国貿易貨物以外の貿易貨物で調査港湾において船卸されたもの。