RDF description of 課程の別
primary topic: 課程の別

課程の別
type: TerminologyConcept
description: 中等教育学校における前期課程・後期課程の別、高等学校及び中等教育学校の後期課程における全日制・定時制・通信制の別、大学院における修士課程・博士課程・専門職学位課程などの別、専修学校における高等課程・専門課程・一般課程の別及び各種学校における課程の別。
created: 2017-12-01
broader: Ta00514
in scheme: TerminologyConceptScheme
top concept of: TerminologyConceptScheme