家族協定の有無
type: TerminologyConcept
description: 農家における家族協定（家族で行っている経営移譲や労働条件、収益の分配等についての取決め）の有無。
created: 2017-12-01
broader: Ta00578
top concept of: TerminologyConceptScheme
in scheme: TerminologyConceptScheme

RDF description of 家族協定の有無
primary topic: 家族協定の有無