RDF description of 家計費支出額
primary topic: 家計費支出額

家計費支出額
type: TerminologyConcept
in scheme: TerminologyConceptScheme
top concept of: TerminologyConceptScheme
narrower: si247010010
narrower: si247020010
broader: Ta00016
created: 2017-12-01
description: 家計上の飲料費（外食費・し好品費を含む。）、住居費、光熱・水道費、被服費、健康医療費、教育費、教養娯楽費、交際費、冠婚葬祭費、その他の諸雑費などの支出額。税金、預貯金、社会保険料、借金返済は含まない。クレジットカード、月賦などで購入した品物の代金は購入時に全額を計上し、定期的な支払は含まない。生命保険料・損害保険料を含む。農家における肥料や農具、商品の仕入れに使った金などの事業上の支払は含まない。